BDBM50130327 CHEMBL3633305
SMILES Nc1n[nH]c2cccc(-c3cccc(NC(=O)Nc4nccs4)c3)c12
InChI Key InChIKey=YMUQVGLMLGFMRS-UHFFFAOYSA-N
Data  1 IC50
  Tab Delimited (TSV)   2D SDfile   Computed 3D by Vconf -m prep SDfile
Find this compound or compounds like it in BindingDB:
Activity Spreadsheet -- Enzyme Inhibition Constant Data from BindingDB
Found 1 hit for monomerid = 50130327
TargetVascular endothelial growth factor receptor 2(Homo sapiens (Human))
The First Affiliated Hospital Of Xi'An Jiaotong University
Curated by ChEMBL
LigandPNGBDBM50130327(CHEMBL3633305)
Affinity DataIC50: >500nM. Assay description: Inhibition of VEGFR-2 (unknown origin) after 1 hr by ADP-Glo assay
In DepthDetails ArticlePubMed