BDBM50130550 2,2-Dimethyl-propionic acid 3-[3-(4-benzenesulfonylamino-benzyl)-thioureido]-2-(3,4-dimethyl-benzyl)-propyl ester::CHEMBL327084
SMILES Cc1ccc(CC(CNC(=S)NCc2ccc(NS(=O)(=O)c3ccccc3)cc2)COC(=O)C(C)(C)C)cc1C
InChI Key InChIKey=YOZFMWWEGMPFQN-UHFFFAOYSA-N
Data  1 KI
  Tab Delimited (TSV)   2D SDfile   Computed 3D by Vconf -m prep SDfile
Find this compound or compounds like it in BindingDB:
Activity Spreadsheet -- Enzyme Inhibition Constant Data from BindingDB
Found 1 hit for monomerid = 50130550
TargetTransient receptor potential cation channel subfamily V member 1(Rattus norvegicus (rat))
Seoul National University
Curated by ChEMBL
LigandPNGBDBM50130550(2,2-Dimethyl-propionic acid 3-[3-(4-benzenesulfony...)
Affinity DataKi:  2.50E+3nM. Assay description: In vitro binding affinity towards Rat Vanilloid receptor 1 (VR1) by [3H]-RTX displacement.
In DepthDetails ArticlePubMed