BDBM50130554 2,2-Dimethyl-propionic acid 2-(3,4-dimethyl-benzyl)-3-[3-(4-isobutyrylamino-benzyl)-thioureido]-propyl ester::CHEMBL322286
SMILES CC(C)C(=O)Nc1ccc(CNC(=S)NCC(COC(=O)C(C)(C)C)Cc2ccc(C)c(C)c2)cc1
InChI Key InChIKey=OFEPAITYEMBORC-UHFFFAOYSA-N
Data  1 KI  1 EC50
  Tab Delimited (TSV)   2D SDfile   Computed 3D by Vconf -m prep SDfile
Find this compound or compounds like it in BindingDB:
Activity Spreadsheet -- Enzyme Inhibition Constant Data from BindingDB
Found 2 hits for monomerid = 50130554
TargetTransient receptor potential cation channel subfamily V member 1(Rattus norvegicus (rat))
Seoul National University
Curated by ChEMBL
LigandPNGBDBM50130554(2,2-Dimethyl-propionic acid 2-(3,4-dimethyl-benzyl...)
Affinity DataKi:  2.60E+3nM. Assay description: In vitro binding affinity towards Rat Vanilloid receptor 1 (VR1) by [3H]-RTX displacement.
In DepthDetails ArticlePubMed
TargetTransient receptor potential cation channel subfamily V member 1(Rattus norvegicus (rat))
Seoul National University
Curated by ChEMBL
LigandPNGBDBM50130554(2,2-Dimethyl-propionic acid 2-(3,4-dimethyl-benzyl...)
Affinity DataEC50:  1.14E+3nM. Assay description: In vitro [Ca2+] influx relative to capsaicin by Rat Vanilloid receptor (VR1) expressing CHO cells
In DepthDetails ArticlePubMed