BDBM50130662 CHEMBL3634511::US10329295, Example 90
SMILES Cn1cc(NC(=O)c2ccc3cnc(N[C@@H]4CCCCNC4)nn23)c(n1)C(F)F
InChI Key InChIKey=MOEMZQSKNWPMLD-LLVKDONJSA-N
Data  3 IC50
  Tab Delimited (TSV)   2D SDfile   Computed 3D by Vconf -m prep SDfile
Find this compound or compounds like it in BindingDB:
Activity Spreadsheet -- Enzyme Inhibition Constant Data from BindingDB
Found 3 hits for monomerid = 50130662
TargetInterleukin-1 receptor-associated kinase 4(Homo sapiens (Human))
Merck Research Laboratories
Curated by ChEMBL
LigandPNGBDBM50130662(CHEMBL3634511 | US10329295, Example 90)
Affinity DataIC50:  9nM. Assay description: Inhibition of IRAK4 in human PBMC
In DepthDetails ArticlePubMed
TargetInterleukin-1 receptor-associated kinase 4(Homo sapiens (Human))
Merck Research Laboratories
Curated by ChEMBL
LigandPNGBDBM50130662(CHEMBL3634511 | US10329295, Example 90)
Affinity DataIC50:  0.700nM. Assay description: The kinase activity of IRAK4 is determined by its ability to catalyze the phosphorylation of a fluorescent polypeptide substrate. The extent of phosp...
In DepthDetails US Patent
TargetInterleukin-1 receptor-associated kinase 4(Homo sapiens (Human))
Merck Research Laboratories
Curated by ChEMBL
LigandPNGBDBM50130662(CHEMBL3634511 | US10329295, Example 90)
Affinity DataIC50:  0.700nM. Assay description: Inhibition of IRAK4 (unknown origin)
In DepthDetails ArticlePubMed