BDBM50130883 CHEMBL406456::epsilon-FITC-DLys-Pro-Gly(PipAm)-Arg-Pro-Tyr--Ile-Leu-OH
SMILES CCC(C)C(NC(=O)C(Cc1ccc(O)cc1)NC(=O)C1CCCN1C(=O)C(CCCNC(N)=N)NC(=O)C(NC(=O)C1CCCN1C(=O)[C@@H](N)CCCCNC(=O)C1OC2(C3C=CC(=O)CC3Oc3cc(O)ccc23)c2ccc(NC(N)=S)cc12)C1CCC(CC1)C(N)=N)C(=O)NC(CC(C)C)C(O)=O
InChI Key InChIKey=LBKZTDFHAARQNK-BSGGRNPWSA-N
Data  1 IC50
  Tab Delimited (TSV)   2D SDfile   Computed 3D by Vconf -m prep SDfile
Find this compound or compounds like it in BindingDB:
Activity Spreadsheet -- Enzyme Inhibition Constant Data from BindingDB
Found 1 hit for monomerid = 50130883
TargetNeurotensin receptor type 1(Homo sapiens (Human))
Washington University
Curated by ChEMBL
LigandPNGBDBM50130883(CHEMBL406456 | epsilon-FITC-DLys-Pro-Gly(PipAm)-Ar...)
Affinity DataIC50:  0.600nM. Assay description: Binding affinity towards neurotensin receptor in membranes prepared from HT-29 cell line, relative to [111In]-labeled neurotensin peptide
In DepthDetails ArticlePubMed