BDBM50130952 5-(4-(trifluoromethyl)benzyloxy)quinazoline-2,4-diamine::5-(4-Trifluoromethyl-benzyloxy)-quinazoline-2,4-diamine::CHEMBL84108::GNF-Pf-1166
SMILES Nc1nc(N)c2c(OCc3ccc(cc3)C(F)(F)F)cccc2n1
InChI Key InChIKey=KMWVEFVCYFWEAK-UHFFFAOYSA-N
Data  1 KI  2 IC50
  Tab Delimited (TSV)   2D SDfile   Computed 3D by Vconf -m prep SDfile
Find this compound or compounds like it in BindingDB:
Activity Spreadsheet -- Enzyme Inhibition Constant Data from BindingDB
Found 3 hits for monomerid = 50130952
TargetDihydrofolate reductase(Escherichia coli)
Mcmaster University
Curated by ChEMBL
LigandPNGBDBM50130952(5-(4-(trifluoromethyl)benzyloxy)quinazoline-2,4-di...)
Affinity DataKi:  130nM. Assay description: Inhibition of Escherichia coli Dihydrofolate reductase in presence of 30 uM Dihydrofolate reductase
In DepthDetails ArticlePubMed
TargetDihydrofolate reductase(Escherichia coli)
Mcmaster University
Curated by ChEMBL
LigandPNGBDBM50130952(5-(4-(trifluoromethyl)benzyloxy)quinazoline-2,4-di...)
Affinity DataIC50:  660nM. Assay description: Inhibition of Escherichia coli Dihydrofolate reductase in presence of 30 uM Dihydrofolate reductase
In DepthDetails ArticlePubMed
TargetDihydrofolate reductase(Escherichia coli)
Mcmaster University
Curated by ChEMBL
LigandPNGBDBM50130952(5-(4-(trifluoromethyl)benzyloxy)quinazoline-2,4-di...)
Affinity DataIC50:  1.10E+3nM. Assay description: Inhibition of Escherichia coli Dihydrofolate reductase in presence of 30 uM Dihydrofolate reductase
In DepthDetails ArticlePubMed