BDBM50130965 2-(2,6-Dimethoxy-phenyl)-5-dipropylamino-3-ethyl-6-methyl-3H-pyrimidin-4-one::CHEMBL83789
SMILES CCCN(CCC)c1c(C)nc(-c2c(OC)cccc2OC)n(CC)c1=O
InChI Key InChIKey=AYWACOPDGDMANU-UHFFFAOYSA-N
Data  1 KI
  Tab Delimited (TSV)   2D SDfile   Computed 3D by Vconf -m prep SDfile
Find this compound or compounds like it in BindingDB:
Activity Spreadsheet -- Enzyme Inhibition Constant Data from BindingDB
Found 1 hit for monomerid = 50130965
TargetCorticotropin-releasing factor receptor 1(Homo sapiens (Human))
Neurogen
Curated by ChEMBL
LigandPNGBDBM50130965(2-(2,6-Dimethoxy-phenyl)-5-dipropylamino-3-ethyl-6...)
Affinity DataKi:  310nM. Assay description: Affinity for Corticotropin releasing factor receptor 1 on IMR-32 (human neuroblastoma) cells by [125I]-sauvagine displacement.
In DepthDetails ArticlePubMed