BDBM50131010 3-[2-(4-Pyrrolidin-1-yl-piperidin-1-yl)-ethanesulfonyl]-1,3,4,5-tetrahydro-2H-benzo[c][1,7]naphthyridin-6-one::CHEMBL83432
SMILES O=c1[nH]c2CN(CCc2c2ccccc12)S(=O)(=O)CCN1CCC(CC1)N1CCCC1
InChI Key InChIKey=PDDNOOQKFCIDMO-UHFFFAOYSA-N
Data  1 IC50
  Tab Delimited (TSV)   2D SDfile   Computed 3D by Vconf -m prep SDfile
Find this compound or compounds like it in BindingDB:
Activity Spreadsheet -- Enzyme Inhibition Constant Data from BindingDB
Found 1 hit for monomerid = 50131010
TargetPoly [ADP-ribose] polymerase 1(Homo sapiens (Human))
Guilford Pharmaceuticals
Curated by ChEMBL
LigandPNGBDBM50131010(3-[2-(4-Pyrrolidin-1-yl-piperidin-1-yl)-ethanesulf...)
Affinity DataIC50:  349nM. Assay description: Inhibition of human recombinant Poly (ADP-ribose) polymerase 1
In DepthDetails ArticlePubMed