BDBM50131100 2-{4-[(S)-2-[(S)-4-Benzyloxycarbonyl-2-(9H-fluoren-9-ylmethoxycarbonylamino)-butyrylamino]-2-((S)-1-carbamoyl-3-methyl-butylcarbamoyl)-ethyl]-phenoxy}-2-fluoro-malonic acid::CHEMBL312922
SMILES CC(C)C[C@H](NC(=O)[C@H](Cc1ccc(OC(F)(C(O)=O)C(O)=O)cc1)NC(=O)[C@H](CCC(=O)OCc1ccccc1)NC(=O)OCC1c2ccccc2-c2ccccc12)C(N)=O
InChI Key InChIKey=UMZCEHLFSSRZFD-FSEITFBQSA-N
Data  2 IC50
  Tab Delimited (TSV)   2D SDfile   Computed 3D by Vconf -m prep SDfile
Find this compound or compounds like it in BindingDB:
Activity Spreadsheet -- Enzyme Inhibition Constant Data from BindingDB
Found 2 hits for monomerid = 50131100
TargetTyrosine-protein phosphatase non-receptor type 1(Homo sapiens (Human))
National Cancer Institute-Frederick
Curated by ChEMBL
LigandPNGBDBM50131100(2-{4-[(S)-2-[(S)-4-Benzyloxycarbonyl-2-(9H-fluoren...)
Affinity DataIC50:  1.50E+3nM. Assay description: Inhibition of human Protein-tyrosine phosphatase 1B expressed in E. coli BL21 (DE3) cells
In DepthDetails ArticlePubMed
TargetProtein-tyrosine-phosphatase(Yersinia pestis)
National Cancer Institute-Frederick
Curated by ChEMBL
LigandPNGBDBM50131100(2-{4-[(S)-2-[(S)-4-Benzyloxycarbonyl-2-(9H-fluoren...)
Affinity DataIC50:  2.90E+3nM. Assay description: Inhibition of Tyrosine phosphatase from Yersinia pestis expressed in E. coli BL21 (DE3) cells
In DepthDetails ArticlePubMed