BDBM50131125 2-(Pyridin-2-ylamino)-benzothiazole-6-carboxylic acid (2-chloro-6-methyl-phenyl)-amide::CHEMBL85406
SMILES Cc1cccc(Cl)c1NC(=O)c1ccc2nc(Nc3ccccn3)sc2c1
InChI Key InChIKey=YOFSDETVDVMCED-UHFFFAOYSA-N
Data  2 IC50
  Tab Delimited (TSV)   2D SDfile   Computed 3D by Vconf -m prep SDfile
Find this compound or compounds like it in BindingDB:
Activity Spreadsheet -- Enzyme Inhibition Constant Data from BindingDB
Found 2 hits for monomerid = 50131125
TargetTyrosine-protein kinase Lck(Homo sapiens (Human))
Bristol-Myers Squibb Pharmaceutical Research Institute
Curated by ChEMBL
LigandPNGBDBM50131125(2-(Pyridin-2-ylamino)-benzothiazole-6-carboxylic a...)
Affinity DataIC50:  84nM. Assay description: Inhibition of human p56 Lck tyrosine kinase
In DepthDetails ArticlePubMed
TargetTyrosine-protein kinase Lck(Homo sapiens (Human))
Bristol-Myers Squibb Pharmaceutical Research Institute
Curated by ChEMBL
LigandPNGBDBM50131125(2-(Pyridin-2-ylamino)-benzothiazole-6-carboxylic a...)
Affinity DataIC50:  84nM. Assay description: Inhibition of human p56 Lck tyrosine kinase
In DepthDetails ArticlePubMed