BDBM50131130 2-(2H-Pyridazin-1-ylamino)-benzothiazole-6-carboxylic acid (2-chloro-6 -methyl-phenyl)-amide::CHEMBL315279
SMILES Cc1cccc(Cl)c1NC(=O)c1ccc2nc(NN3C=CCC=N3)sc2c1
InChI Key InChIKey=UFCRFKKFIGKAAR-UHFFFAOYSA-N
Data  1 IC50
  Tab Delimited (TSV)   2D SDfile   Computed 3D by Vconf -m prep SDfile
Find this compound or compounds like it in BindingDB:
Activity Spreadsheet -- Enzyme Inhibition Constant Data from BindingDB
Found 1 hit for monomerid = 50131130
TargetTyrosine-protein kinase Lck(Homo sapiens (Human))
Bristol-Myers Squibb Pharmaceutical Research Institute
Curated by ChEMBL
LigandPNGBDBM50131130(2-(2H-Pyridazin-1-ylamino)-benzothiazole-6-carboxy...)
Affinity DataIC50:  41nM. Assay description: Inhibition of human p56 Lck tyrosine kinase
In DepthDetails ArticlePubMed