BDBM50131139 2-(6-Methyl-pyrimidin-4-ylamino)-benzothiazole-6-carboxylic acid (2-chloro-6-methyl-phenyl)-amide::CHEMBL89072
SMILES Cc1cc(Nc2nc3ccc(cc3s2)C(=O)Nc2c(C)cccc2Cl)ncn1
InChI Key InChIKey=CJEUQKILUZVHKN-UHFFFAOYSA-N
Data  1 IC50
  Tab Delimited (TSV)   2D SDfile   Computed 3D by Vconf -m prep SDfile
Find this compound or compounds like it in BindingDB:
Activity Spreadsheet -- Enzyme Inhibition Constant Data from BindingDB
Found 1 hit for monomerid = 50131139
TargetTyrosine-protein kinase Lck(Homo sapiens (Human))
Bristol-Myers Squibb Pharmaceutical Research Institute
Curated by ChEMBL
LigandPNGBDBM50131139(2-(6-Methyl-pyrimidin-4-ylamino)-benzothiazole-6-c...)
Affinity DataIC50:  21nM. Assay description: Inhibition of human p56 Lck tyrosine kinase
In DepthDetails ArticlePubMed