BDBM50131221 CHEMBL3634661
SMILES [H][C@@]12C[C@@]3(CC[C@@](C)(O3)[C@H](O)CC(=O)\C(C)=C\[C@@H](O)C[C@@]1(C)O2)C(C)C
InChI Key InChIKey=YCQANNMZZHKNIZ-ZLIHTVQJSA-N
Data  1 EC50
  Tab Delimited (TSV)   2D SDfile   Computed 3D by Vconf -m prep SDfile
Find this compound or compounds like it in BindingDB:
Activity Spreadsheet -- Enzyme Inhibition Constant Data from BindingDB
Found 1 hit for monomerid = 50131221
TargetX-box-binding protein 1(Rattus norvegicus)
Chinese Academy Of Medical Sciences And Peking Union Medical College
Curated by ChEMBL
LigandPNGBDBM50131221(CHEMBL3634661)
Affinity DataEC50:  880nM. Assay description: Transactivation of XBP1 in rat IEC-6 cells after 48 hrs by dual luciferase reporter gene assay
In DepthDetails ArticlePubMed