BDBM50131328 (R)-2-[(Formyl-hydroxy-amino)-methyl]-hexanoic acid [2-(4-chloro-phenyl)-1-((S)-dimethyl-carbamoyl)-ethyl]-amide::CHEMBL94165
SMILES CCCC[C@H](CN(O)C=O)C(=O)N[C@@H](Cc1ccc(Cl)cc1)C(=O)N(C)C
InChI Key InChIKey=WYRIJXVSXCBBBR-WBVHZDCISA-N
Data  1 IC50
  Tab Delimited (TSV)   2D SDfile   Computed 3D by Vconf -m prep SDfile
Find this compound or compounds like it in BindingDB:
Activity Spreadsheet -- Enzyme Inhibition Constant Data from BindingDB
Found 1 hit for monomerid = 50131328
TargetPeptide deformylase(Escherichia coli)
British Biotech Pharmaceuticals
Curated by ChEMBL
LigandPNGBDBM50131328((R)-2-[(Formyl-hydroxy-amino)-methyl]-hexanoic aci...)
Affinity DataIC50:  50nM. Assay description: Inhibition concentration against Escherichia coli peptide deformylase.
In DepthDetails ArticlePubMed