BDBM50131349 (R)-7,8-Dimethoxy-3-[4-((Z)-3-phenyl-allyl)-piperazin-1-ylmethyl]-3a,4-dihydro-3H-chromeno[4,3-c]isoxazole::CHEMBL420830
SMILES [H][C@@]12COc3cc(OC)c(OC)cc3C1=NO[C@H]2CN1CCN(C\C=C/c2ccccc2)CC1
InChI Key InChIKey=WZOMJNATDSYQHS-VTYJTISCSA-N
Data  3 KI
  Tab Delimited (TSV)   2D SDfile   Computed 3D by Vconf -m prep SDfile
Find this compound or compounds like it in BindingDB:
Activity Spreadsheet -- Enzyme Inhibition Constant Data from BindingDB
Found 3 hits for monomerid = 50131349
TargetAlpha-2C adrenergic receptor(Homo sapiens (Human))
Johnson & Johnson Pharmaceutical Research & Development
Curated by ChEMBL
LigandPNGBDBM50131349((R)-7,8-Dimethoxy-3-[4-((Z)-3-phenyl-allyl)-pipera...)
Affinity DataKi:  35nM. Assay description: In vitro binding affinity towards human adrenergic alpha-2C adrenergic receptor using [3H]-rauwolscine
In DepthDetails ArticlePubMed
TargetSodium-dependent serotonin transporter(Rattus norvegicus (rat))
Johnson & Johnson Pharmaceutical Research & Development
Curated by ChEMBL
LigandPNGBDBM50131349((R)-7,8-Dimethoxy-3-[4-((Z)-3-phenyl-allyl)-pipera...)
Affinity DataKi:  35nM. Assay description: In vitro binding affinity towards rat serotonin transporter
In DepthDetails ArticlePubMed
TargetAlpha-2A adrenergic receptor(Homo sapiens (Human))
Johnson & Johnson Pharmaceutical Research & Development
Curated by ChEMBL
LigandPNGBDBM50131349((R)-7,8-Dimethoxy-3-[4-((Z)-3-phenyl-allyl)-pipera...)
Affinity DataKi:  35nM. Assay description: In vitro binding affinity towards human alpha-2A adrenergic receptor using [3H]-rauwolscine
In DepthDetails ArticlePubMed