BDBM50131361 7,8-Dimethoxy-3-(4-quinolin-3-ylmethyl-piperazin-1-ylmethyl)-3a,4-dihydro-3H-chromeno[4,3-c]isoxazole::CHEMBL91824
SMILES COc1cc2OCC3C(CN4CCN(Cc5cnc6ccccc6c5)CC4)ON=C3c2cc1OC
InChI Key InChIKey=SWMRFMZFBGUQMK-UHFFFAOYSA-N
Data  4 KI
  Tab Delimited (TSV)   2D SDfile   Computed 3D by Vconf -m prep SDfile
Find this compound or compounds like it in BindingDB:
Activity Spreadsheet -- Enzyme Inhibition Constant Data from BindingDB
Found 4 hits for monomerid = 50131361
TargetSodium-dependent serotonin transporter(Rattus norvegicus (rat))
Johnson & Johnson Pharmaceutical Research & Development
Curated by ChEMBL
LigandPNGBDBM50131361(7,8-Dimethoxy-3-(4-quinolin-3-ylmethyl-piperazin-1...)
Affinity DataKi:  14nM. Assay description: In vitro binding affinity towards rat serotonin transporter
In DepthDetails ArticlePubMed
TargetAlpha-2C adrenergic receptor(Homo sapiens (Human))
Johnson & Johnson Pharmaceutical Research & Development
Curated by ChEMBL
LigandPNGBDBM50131361(7,8-Dimethoxy-3-(4-quinolin-3-ylmethyl-piperazin-1...)
Affinity DataKi:  30nM. Assay description: In vitro binding affinity towards human adrenergic alpha-2C adrenergic receptor using [3H]-rauwolscine
In DepthDetails ArticlePubMed
TargetAlpha-2A adrenergic receptor(Homo sapiens (Human))
Johnson & Johnson Pharmaceutical Research & Development
Curated by ChEMBL
LigandPNGBDBM50131361(7,8-Dimethoxy-3-(4-quinolin-3-ylmethyl-piperazin-1...)
Affinity DataKi:  34nM. Assay description: In vitro binding affinity towards human alpha-2A adrenergic receptor using [3H]-rauwolscine
In DepthDetails ArticlePubMed
TargetAlpha-2B adrenergic receptor(Homo sapiens (Human))
Johnson & Johnson Pharmaceutical Research & Development
Curated by ChEMBL
LigandPNGBDBM50131361(7,8-Dimethoxy-3-(4-quinolin-3-ylmethyl-piperazin-1...)
Affinity DataKi: >1.00E+3nM. Assay description: In vitro binding affinity towards human alpha-2B adrenergic receptor using [3H]-rauwolscine
In DepthDetails ArticlePubMed