BDBM50131415 CHEMBL3632765
SMILES Nc1nc2nc(CC3CCCCC3)ncc2c(N)c1C#N
InChI Key InChIKey=IKSIEIXIIKHCFA-UHFFFAOYSA-N
Data  1 IC50
  Tab Delimited (TSV)   2D SDfile   Computed 3D by Vconf -m prep SDfile
Find this compound or compounds like it in BindingDB:
Activity Spreadsheet -- Enzyme Inhibition Constant Data from BindingDB
Found 1 hit for monomerid = 50131415
TargetDNA ligase(Staphylococcus aureus)
Astrazeneca
Curated by ChEMBL
LigandPNGBDBM50131415(CHEMBL3632765)
Affinity DataIC50:  3.70E+3nM. Assay description: Inhibition of Staphylococcus aureus NAD(+)-dependent DNA ligase
In DepthDetails ArticlePubMed