BDBM50131622 4-Chloro-5-(3-fluoro-4-methoxy-phenyl)-1-(4-methanesulfonyl-phenyl)-1H-imidazole::4-chloro-5-(3-fluoro-4-methoxyphenyl)-1-(4-(methylsulfonyl)phenyl)-1H-imidazole::CHEMBL117862
SMILES COc1ccc(cc1F)-c1c(Cl)ncn1-c1ccc(cc1)S(C)(=O)=O
InChI Key InChIKey=YVZIBNGIENXYSE-UHFFFAOYSA-N
Data  5 IC50
  Tab Delimited (TSV)   2D SDfile   Computed 3D by Vconf -m prep SDfile
Find this compound or compounds like it in BindingDB:
Activity Spreadsheet -- Enzyme Inhibition Constant Data from BindingDB
Found 5 hits for monomerid = 50131622
TargetProstaglandin G/H synthase 2(Homo sapiens (Human))
Domp&Egrove
Curated by ChEMBL
LigandPNGBDBM50131622(4-Chloro-5-(3-fluoro-4-methoxy-phenyl)-1-(4-methan...)
Affinity DataIC50:  156nM. Assay description: In vitro percent inhibition of Prostaglandin G/H synthase 2 (COX-2) in human whole blood was determined
In DepthDetails ArticlePubMed
TargetProstaglandin G/H synthase 1(Homo sapiens (Human))
Domp&Egrove
Curated by ChEMBL
LigandPNGBDBM50131622(4-Chloro-5-(3-fluoro-4-methoxy-phenyl)-1-(4-methan...)
Affinity DataIC50: >1.00E+4nM. Assay description: In vitro inhibitory activity against human Prostaglandin G/H synthase 1 (COX-1) in U-937 cells
In DepthDetails ArticlePubMed
TargetProstaglandin G/H synthase 2(Homo sapiens (Human))
Domp&Egrove
Curated by ChEMBL
LigandPNGBDBM50131622(4-Chloro-5-(3-fluoro-4-methoxy-phenyl)-1-(4-methan...)
Affinity DataIC50:  90nM. Assay description: Activity of COX2 in human heparinized blood assessed as inhibition of LPS-induced PGE2 production after 24 hrs
In DepthDetails ArticlePubMed
TargetProstaglandin G/H synthase 2(Homo sapiens (Human))
Domp&Egrove
Curated by ChEMBL
LigandPNGBDBM50131622(4-Chloro-5-(3-fluoro-4-methoxy-phenyl)-1-(4-methan...)
Affinity DataIC50:  4nM. Assay description: In vitro percent inhibition of Prostaglandin G/H synthase 2 (COX-2) in human whole blood was determined
In DepthDetails ArticlePubMed
TargetProstaglandin G/H synthase 1(Homo sapiens (Human))
Domp&Egrove
Curated by ChEMBL
LigandPNGBDBM50131622(4-Chloro-5-(3-fluoro-4-methoxy-phenyl)-1-(4-methan...)
Affinity DataIC50:  5.80E+3nM. Assay description: Inhibition of COX1 in human whole blood assessed as TxB2 production after 1 hr
In DepthDetails ArticlePubMed