BDBM50131775 CHEMBL3634122
SMILES C[C@]1(COCC(N)=N1)c1cccc(NC(=O)c2ccc(Cl)cn2)c1
InChI Key InChIKey=ZZUPAAPYPBQGKS-KRWDZBQOSA-N
Data  3 IC50
PDB links: 1 PDB ID matches this monomer.
  Tab Delimited (TSV)   2D SDfile   Computed 3D by Vconf -m prep SDfile
Find this compound or compounds like it in BindingDB:
Activity Spreadsheet -- Enzyme Inhibition Constant Data from BindingDB
Found 3 hits for monomerid = 50131775
TargetBeta-secretase 1(Mus musculus (Mouse))
Janssen Pharmaceutica
Curated by ChEMBL
LigandPNGBDBM50131775(CHEMBL3634122)
Affinity DataIC50:  7.40nM. Assay description: Inhibition of BACE1 in mouse Neuro-2a cells expressing wild type human APP695 assessed as reduction in amyloid beta-42 production after 18 hrs by san...
TargetBeta-secretase 1(Homo sapiens (Human))
Janssen Pharmaceutica
Curated by ChEMBL
LigandPNGBDBM50131775(CHEMBL3634122)
Affinity DataIC50:  9.10nM. Assay description: Inhibition of BACE1 in human SKNBE2 cells expressing wild type human APP695 assessed as reduction in amyloid beta-42 production after 18 hrs by sandw...
TargetBeta-secretase 1(Homo sapiens (Human))
Janssen Pharmaceutica
Curated by ChEMBL
LigandPNGBDBM50131775(CHEMBL3634122)
Affinity DataIC50:  44nM. Assay description: Inhibition of BACE1 (unknown origin) using APP Swedish mutant harboring Lys-Met/Asn-Leu mutation in beta-secretase cleavage site as substrate by FRET...