BDBM50131817 CHEMBL3634606
SMILES CC(C)COc1ncc(cc1Cl)-c1nn(C)c2cc3c(NS(=O)(=O)C4CC4)noc3cc12
InChI Key InChIKey=LCDGCXIWJWXFJD-UHFFFAOYSA-N
Data  1 IC50
  Tab Delimited (TSV)   2D SDfile   Computed 3D by Vconf -m prep SDfile
Find this compound or compounds like it in BindingDB:
Activity Spreadsheet -- Enzyme Inhibition Constant Data from BindingDB
Found 1 hit for monomerid = 50131817
TargetSodium channel protein type 9 subunit alpha(Homo sapiens (Human))
Therachem Research Medilab (India)
Curated by ChEMBL
LigandPNGBDBM50131817(CHEMBL3634606)
Affinity DataIC50:  400nM. Assay description: Inhibition of human Nav1.7 by patch-clamp assay
In DepthDetails ArticlePubMed