BDBM50131896 CHEMBL3633895
SMILES COc1cccc(c1)C(=O)NCC(=O)N[C@H](C)c1ccccc1
InChI Key InChIKey=ASAANGCWEOJNQY-CYBMUJFWSA-N
Data  1 EC50
  Tab Delimited (TSV)   2D SDfile   Computed 3D by Vconf -m prep SDfile
Find this compound or compounds like it in BindingDB:
Activity Spreadsheet -- Enzyme Inhibition Constant Data from BindingDB
Found 1 hit for monomerid = 50131896
TargetProbable G-protein coupled receptor 139(Homo sapiens (Human))
Janssen Research And Development
Curated by ChEMBL
LigandPNGBDBM50131896(CHEMBL3633895)
Affinity DataEC50:  1.70E+3nM. Assay description: Binding affinity against delta opioid receptor in mouse hot plate test
In DepthDetails ArticlePubMed