BDBM50131911 1-(4-Aminomethyl-3-hydroxy-5-hydroxymethyl-tetrahydro-furan-2-yl)-5-methyl-1H-pyrimidine-2,4-dione::CHEMBL124682
SMILES Cc1cn([C@@H]2O[C@H](CO)[C@@H](CN)[C@H]2O)c(=O)[nH]c1=O
InChI Key InChIKey=JYDMCTQCWURNLL-FDDDBJFASA-N
Data  2 KI
  Tab Delimited (TSV)   2D SDfile   Computed 3D by Vconf -m prep SDfile
Find this compound or compounds like it in BindingDB:
Activity Spreadsheet -- Enzyme Inhibition Constant Data from BindingDB
Found 2 hits for monomerid = 50131911
TargetThymidine kinase, cytosolic(Homo sapiens (Human))
Ghent University
Curated by ChEMBL
LigandPNGBDBM50131911(1-(4-Aminomethyl-3-hydroxy-5-hydroxymethyl-tetrahy...)
Affinity DataKi:  1.10E+5nM. Assay description: In Vitro inhibition of Thymidine Monophosphatase Kinase (TMPKh)
In DepthDetails ArticlePubMed
TargetThymidylate kinase(Mycobacterium tuberculosis)
Ghent University
Curated by ChEMBL
LigandPNGBDBM50131911(1-(4-Aminomethyl-3-hydroxy-5-hydroxymethyl-tetrahy...)
Affinity DataKi:  3.93E+5nM. Assay description: In Vitro inhibition of Thymidine Monophosphatase Kinase of Mycobacterium tuberculosis (TMPKm)
In DepthDetails ArticlePubMed