BDBM50131994 CHEMBL3633882
SMILES C[C@H](NC(=O)CNC(=O)c1cccc(c1)C(F)(F)F)c1ccccc1
InChI Key InChIKey=ZUULHXJVFIPCBX-LBPRGKRZSA-N
Data  1 EC50
  Tab Delimited (TSV)   2D SDfile   Computed 3D by Vconf -m prep SDfile
Find this compound or compounds like it in BindingDB:
Activity Spreadsheet -- Enzyme Inhibition Constant Data from BindingDB
Found 1 hit for monomerid = 50131994
TargetProbable G-protein coupled receptor 139(Homo sapiens (Human))
Janssen Research And Development
Curated by ChEMBL
LigandPNGBDBM50131994(CHEMBL3633882)
Affinity DataEC50:  52nM. Assay description: Inhibition of [3H]-U-69,593 binding to Opioid receptor kappa 1
In DepthDetails ArticlePubMed