BDBM50132161 CHEMBL3633611
SMILES C=CCOc1cccc2C(=O)c3cc(C=O)cc(OCC=C)c3C(=O)c12
InChI Key InChIKey=FUKFIWUBCVWRSC-UHFFFAOYSA-N
Data  1 IC50
  Tab Delimited (TSV)   2D SDfile   Computed 3D by Vconf -m prep SDfile
Find this compound or compounds like it in BindingDB:
Activity Spreadsheet -- Enzyme Inhibition Constant Data from BindingDB
Found 1 hit for monomerid = 50132161
TargetPolyphenol oxidase 2(Agaricus bisporus (Common mushroom))
Shaoyang University
Curated by ChEMBL
LigandPNGBDBM50132161(CHEMBL3633611)
Affinity DataIC50:  9.24E+4nM. Assay description: Inhibition constant against Adenosine A2a receptor
In DepthDetails ArticlePubMed