BDBM50132297 1-((2R,4S,5R)-5-(aminomethyl)-4-hydroxy-tetrahydrofuran-2-yl)-5-methylpyrimidine-2,4(1H,3H)-dione::1-((2R,5R)-5-Aminomethyl-4-hydroxy-tetrahydro-furan-2-yl)-5-methyl-1H-pyrimidine-2,4-dione::5'-AMINO-5'-DEOXYTHYMIDINE::CHEMBL319447
SMILES Cc1cn([C@H]2C[C@H](O)[C@@H](CN)O2)c(=O)[nH]c1=O
InChI Key InChIKey=PYWLBQPICCQJFF-XLPZGREQSA-N
Data  3 KI
PDB links: 3 PDB IDs match this monomer.
  Tab Delimited (TSV)   2D SDfile   Computed 3D by Vconf -m prep SDfile
Find this compound or compounds like it in BindingDB:
Activity Spreadsheet -- Enzyme Inhibition Constant Data from BindingDB
Found 3 hits for monomerid = 50132297
TargetThymidine kinase, cytosolic(Rattus norvegicus)
TBA
Curated by ChEMBL
LigandPNGBDBM50132297(1-((2R,4S,5R)-5-(aminomethyl)-4-hydroxy-tetrahydro...)
Affinity DataKi:  2.40E+3nM. Assay description: Competitive inhibition against rat cytoplasmic Thymidine kinase
In DepthDetails ArticlePubMed
TargetThymidylate kinase(Mycobacterium tuberculosis)
Ghent University
Curated by ChEMBL
LigandPNGBDBM50132297(1-((2R,4S,5R)-5-(aminomethyl)-4-hydroxy-tetrahydro...)
Affinity DataKi:  1.20E+4nM. Assay description: Inhibitory activity against thymidine monophosphate kinase (TMPK) in Mycobacterium tuberculosis
In DepthDetails ArticlePubMed
TargetThymidine kinase 2, mitochondrial (Predicted)(Rattus norvegicus)
TBA
Curated by ChEMBL
LigandPNGBDBM50132297(1-((2R,4S,5R)-5-(aminomethyl)-4-hydroxy-tetrahydro...)
Affinity DataKi:  4.60E+6nM. Assay description: Competitive inhibition against rat mitochondrial thymidine kinase
In DepthDetails ArticlePubMed