BDBM50132331 (4-{3-[4-Amino-5-(3-methoxy-phenyl)-pyrrolo[2,3-d]pyrimidin-7-yl]-benzoylamino}-2-phosphono-phenyl)-phosphonic acid::CHEMBL105516
SMILES COc1cccc(c1)-c1cn(-c2cccc(c2)C(=O)Nc2ccc(c(c2)P(O)(O)=O)P(O)(O)=O)c2ncnc(N)c12
InChI Key InChIKey=GLBBWJBFQWIPTQ-UHFFFAOYSA-N
Data  1 IC50
  Tab Delimited (TSV)   2D SDfile   Computed 3D by Vconf -m prep SDfile
Find this compound or compounds like it in BindingDB:
Activity Spreadsheet -- Enzyme Inhibition Constant Data from BindingDB
Found 1 hit for monomerid = 50132331
TargetProto-oncogene tyrosine-protein kinase Src(Homo sapiens (Human))
Ariad Pharmaceuticals
Curated by ChEMBL
LigandPNGBDBM50132331((4-{3-[4-Amino-5-(3-methoxy-phenyl)-pyrrolo[2,3-d]...)
Affinity DataIC50:  2.50E+3nM. Assay description: In vitro inhibition of Src protein tryrosine kinase using the Scintillation proximity kinase assay.
In DepthDetails ArticlePubMed