BDBM50132466 2-[4-((S)-2-tert-Butoxycarbonylamino-3-{4-[(2-carboxy-propyl)-oxalyl-amino]-phenyl}-propionylamino)-butoxy]-6-hydroxy-benzoic acid methyl ester::CHEMBL108473
SMILES COC(=O)c1c(O)cccc1OCCCCNC(=O)[C@H](Cc1ccc(cc1)N(CC(C)C(O)=O)C(=O)C(O)=O)NC(=O)OC(C)(C)C
InChI Key InChIKey=JLBORDITBUFFMT-BPARTEKVSA-N
Data  4 KI
  Tab Delimited (TSV)   2D SDfile   Computed 3D by Vconf -m prep SDfile
Find this compound or compounds like it in BindingDB:
Activity Spreadsheet -- Enzyme Inhibition Constant Data from BindingDB
Found 4 hits for monomerid = 50132466
TargetTyrosine-protein phosphatase non-receptor type 1(Homo sapiens (Human))
Abbott Laboratories
Curated by ChEMBL
LigandPNGBDBM50132466(2-[4-((S)-2-tert-Butoxycarbonylamino-3-{4-[(2-carb...)
Affinity DataKi:  3.20E+3nM. Assay description: Inhibition of Protein-tyrosine phosphatase 1B (PTP1B)
In DepthDetails ArticlePubMed
TargetTyrosine-protein phosphatase non-receptor type 1(Homo sapiens (Human))
Abbott Laboratories
Curated by ChEMBL
LigandPNGBDBM50132466(2-[4-((S)-2-tert-Butoxycarbonylamino-3-{4-[(2-carb...)
Affinity DataKi:  3.20E+3nM. Assay description: Inhibition of PTP1B (unknown origin)
In DepthDetails Article
TargetTyrosine-protein phosphatase non-receptor type 1(Homo sapiens (Human))
Abbott Laboratories
Curated by ChEMBL
LigandPNGBDBM50132466(2-[4-((S)-2-tert-Butoxycarbonylamino-3-{4-[(2-carb...)
Affinity DataKi:  3.24E+3nM. Assay description: Inhibition of PTP1B (unknown origin)
In DepthDetails Article
TargetTyrosine-protein phosphatase non-receptor type 22(Homo sapiens (Human))
Abbott Laboratories
Curated by ChEMBL
LigandPNGBDBM50132466(2-[4-((S)-2-tert-Butoxycarbonylamino-3-{4-[(2-carb...)
Affinity DataKi:  1.67E+4nM. Assay description: Inhibition of T-cell Protein Tyrosine Phosphatase (TCPTP)
In DepthDetails ArticlePubMed