BDBM50132482 CHEMBL3633768
SMILES COc1cc2ncnc(Nc3ccc(Cl)cc3Cl)c2cc1OCCCCC(=O)NO
InChI Key InChIKey=CJONTKGJHSXWJP-UHFFFAOYSA-N
Data  2 IC50
  Tab Delimited (TSV)   2D SDfile   Computed 3D by Vconf -m prep SDfile
Find this compound or compounds like it in BindingDB:
Activity Spreadsheet -- Enzyme Inhibition Constant Data from BindingDB
Found 2 hits for monomerid = 50132482
TargetVascular endothelial growth factor receptor 2(Homo sapiens (Human))
China Pharmaceutical University
Curated by ChEMBL
LigandPNGBDBM50132482(CHEMBL3633768)
Affinity DataIC50:  115nM. Assay description: Binding affinity for prostanoid EP4 receptor
In DepthDetails ArticlePubMed
TargetHistone deacetylase(Homo sapiens (Human))
China Pharmaceutical University
Curated by ChEMBL
LigandPNGBDBM50132482(CHEMBL3633768)
Affinity DataIC50:  14nM. Assay description: Inhibitory concentration against Beta Glucosidase from Almonds
In DepthDetails ArticlePubMed