BDBM50132486 CHEMBL3633771
SMILES COc1cc2ncnc(Nc3cc(Cl)ccc3Cl)c2cc1OCCCC(=O)NO
InChI Key InChIKey=MTRBHEQVJAOTRA-UHFFFAOYSA-N
Data  2 IC50
  Tab Delimited (TSV)   2D SDfile   Computed 3D by Vconf -m prep SDfile
Find this compound or compounds like it in BindingDB:
Activity Spreadsheet -- Enzyme Inhibition Constant Data from BindingDB
Found 2 hits for monomerid = 50132486
TargetVascular endothelial growth factor receptor 2(Homo sapiens (Human))
China Pharmaceutical University
Curated by ChEMBL
LigandPNGBDBM50132486(CHEMBL3633771)
Affinity DataIC50:  2.14E+3nM. Assay description: Effective concentration required for prostanoid EP4 receptor activity was determined
In DepthDetails ArticlePubMed
TargetHistone deacetylase(Homo sapiens (Human))
China Pharmaceutical University
Curated by ChEMBL
LigandPNGBDBM50132486(CHEMBL3633771)
Affinity DataIC50:  57nM. Assay description: Inhibitory concentration against Beta Glucosidase from Almonds
In DepthDetails ArticlePubMed