BDBM50132547 1-Phenylacetyl-piperidine-2-carboxylic acid 1-(3-carboxymethoxy-phenyl)-3-(3,4-dimethoxy-phenyl)-propyl ester::CHEMBL325083
SMILES COc1ccc(CC[C@@H](OC(=O)[C@@H]2CCCCN2C(=O)Cc2ccccc2)c2cccc(OCC(O)=O)c2)cc1OC
InChI Key InChIKey=SAVJQJYEOVAGCP-WUFINQPMSA-N
Data  3 IC50
  Tab Delimited (TSV)   2D SDfile   Computed 3D by Vconf -m prep SDfile
Find this compound or compounds like it in BindingDB:
Activity Spreadsheet -- Enzyme Inhibition Constant Data from BindingDB
Found 3 hits for monomerid = 50132547
TargetPeptidyl-prolyl cis-trans isomerase FKBP1A(Homo sapiens (Human))
Ariad Gene Therapeutics
Curated by ChEMBL
LigandPNGBDBM50132547(1-Phenylacetyl-piperidine-2-carboxylic acid 1-(3-c...)
Affinity DataIC50:  1.53E+3nM. Assay description: Inhibition of binding to Phe36Val (F36V) mutant of FK506 binding protein 12
In DepthDetails ArticlePubMed
TargetPeptidyl-prolyl cis-trans isomerase FKBP1A(Homo sapiens (Human))
Ariad Gene Therapeutics
Curated by ChEMBL
LigandPNGBDBM50132547(1-Phenylacetyl-piperidine-2-carboxylic acid 1-(3-c...)
Affinity DataIC50:  1.53E+3nM. Assay description: Inhibition of binding to Phe36Val (F36V) mutant of FK506 binding protein 12
In DepthDetails ArticlePubMed
TargetPeptidyl-prolyl cis-trans isomerase FKBP1A(Homo sapiens (Human))
Ariad Gene Therapeutics
Curated by ChEMBL
LigandPNGBDBM50132547(1-Phenylacetyl-piperidine-2-carboxylic acid 1-(3-c...)
Affinity DataIC50:  1.53E+3nM. Assay description: Binding affinity for Mutant F36V-FK506 binding protein by competitive assay based on fluorescence polarization.
In DepthDetails ArticlePubMed