BDBM50132781 CHEMBL3634423
SMILES Cc1ccoc1C(=O)Nc1ccc(N2C(=O)c3cccc(C)c3C2=O)c(C)c1
InChI Key InChIKey=VXOPQVWLUHAERE-UHFFFAOYSA-N
Data  1 IC50  2 EC50
  Tab Delimited (TSV)   2D SDfile   Computed 3D by Vconf -m prep SDfile
Find this compound or compounds like it in BindingDB:
Activity Spreadsheet -- Enzyme Inhibition Constant Data from BindingDB
Found 3 hits for monomerid = 50132781
TargetMetabotropic glutamate receptor 1(Homo sapiens (Human))
Vanderbilt University Medical Center
Curated by ChEMBL
LigandPNGBDBM50132781(CHEMBL3634423)
Affinity DataEC50:  21nM. Assay description: Displacement of [125I]NPY from human NPY1 receptor expressed in CHO cells
In DepthDetails ArticlePubMed
TargetMetabotropic glutamate receptor 4(Homo sapiens (Human))
Vanderbilt University Medical Center
Curated by ChEMBL
LigandPNGBDBM50132781(CHEMBL3634423)
Affinity DataEC50:  422nM. Assay description: Positive allosteric modulation of human mGluR4 by calcium mobilization assay
In DepthDetails ArticlePubMed
TargetMetabotropic glutamate receptor 1(Homo sapiens (Human))
Vanderbilt University Medical Center
Curated by ChEMBL
LigandPNGBDBM50132781(CHEMBL3634423)
Affinity DataIC50:  21nM. Assay description: Positive allosteric modulation of human mGluR1 by calcium mobilization assay
In DepthDetails ArticlePubMed