BDBM50132891 (2,5-Dimethyl-3-phenyl-2H-pyrazolo[4,3-b]pyridin-7-yl)-dipropyl-amine::CHEMBL422784
SMILES CCCN(CCC)c1cc(C)nc2c(-c3ccccc3)n(C)nc12
InChI Key InChIKey=RXYPEFBDARNINZ-UHFFFAOYSA-N
Data  1 KI
  Tab Delimited (TSV)   2D SDfile   Computed 3D by Vconf -m prep SDfile
Find this compound or compounds like it in BindingDB:
Activity Spreadsheet -- Enzyme Inhibition Constant Data from BindingDB
Found 1 hit for monomerid = 50132891
TargetCorticotropin-releasing factor receptor 1(Homo sapiens (Human))
Neurocrine Biosciences
Curated by ChEMBL
LigandPNGBDBM50132891((2,5-Dimethyl-3-phenyl-2H-pyrazolo[4,3-b]pyridin-7...)
Affinity DataKi:  230nM. Assay description: Binding affinity to the human corticotropin releasing factor receptor 1 expressed in HEK273 cells
In DepthDetails ArticlePubMed