BDBM50132963 CHEMBL115928::[8-(4-Methoxy-phenyl)-2-methyl-quinolin-4-yl]-dipropyl-amine
SMILES CCCN(CCC)c1cc(C)nc2c(cccc12)-c1ccc(OC)cc1
InChI Key InChIKey=JGILCQPWSSYFPW-UHFFFAOYSA-N
Data  1 KI
  Tab Delimited (TSV)   2D SDfile   Computed 3D by Vconf -m prep SDfile
Find this compound or compounds like it in BindingDB:
Activity Spreadsheet -- Enzyme Inhibition Constant Data from BindingDB
Found 1 hit for monomerid = 50132963
TargetCorticotropin-releasing factor receptor 1(Homo sapiens (Human))
Neurocrine Biosciences
Curated by ChEMBL
LigandPNGBDBM50132963(CHEMBL115928 | [8-(4-Methoxy-phenyl)-2-methyl-quin...)
Affinity DataKi:  52nM. Assay description: Binding affinity towards cloned human Corticotropin releasing factor receptor 1 expressed in CHO cells using [125I]-o-CRF as the radioligand
In DepthDetails ArticlePubMed