BDBM50132966 CHEMBL114422::Cyclopropylmethyl-[8-(2,4-dichloro-phenyl)-2,7-dimethyl-quinolin-4-yl]-propyl-amine
SMILES CCCN(CC1CC1)c1cc(C)nc2c(c(C)ccc12)-c1ccc(Cl)cc1Cl
InChI Key InChIKey=OTYPQCHBGIXCJR-UHFFFAOYSA-N
Data  1 KI
  Tab Delimited (TSV)   2D SDfile   Computed 3D by Vconf -m prep SDfile
Find this compound or compounds like it in BindingDB:
Activity Spreadsheet -- Enzyme Inhibition Constant Data from BindingDB
Found 1 hit for monomerid = 50132966
TargetCorticotropin-releasing factor receptor 1(Homo sapiens (Human))
Neurocrine Biosciences
Curated by ChEMBL
LigandPNGBDBM50132966(CHEMBL114422 | Cyclopropylmethyl-[8-(2,4-dichloro-...)
Affinity DataKi:  2.5nM. Assay description: Binding affinity towards cloned human Corticotropin releasing factor receptor 1 expressed in CHO cells using [125I]-o-CRF as the radioligand
In DepthDetails ArticlePubMed