BDBM50132973 CHEMBL114596::Cyclopropylmethyl-[2-methyl-8-(2,4,6-trimethyl-phenyl)-quinolin-4-yl]-propyl-amine
SMILES CCCN(CC1CC1)c1cc(C)nc2c(cccc12)-c1c(C)cc(C)cc1C
InChI Key InChIKey=XISLMRFZWRPSLA-UHFFFAOYSA-N
Data  1 KI
  Tab Delimited (TSV)   2D SDfile   Computed 3D by Vconf -m prep SDfile
Find this compound or compounds like it in BindingDB:
Activity Spreadsheet -- Enzyme Inhibition Constant Data from BindingDB
Found 1 hit for monomerid = 50132973
TargetCorticotropin-releasing factor receptor 1(Homo sapiens (Human))
Neurocrine Biosciences
Curated by ChEMBL
LigandPNGBDBM50132973(CHEMBL114596 | Cyclopropylmethyl-[2-methyl-8-(2,4,...)
Affinity DataKi:  2.20nM. Assay description: Binding affinity towards cloned human Corticotropin releasing factor receptor 1 expressed in CHO cells using [125I]-o-CRF as the radioligand
In DepthDetails ArticlePubMed