BDBM50133105 5,6-Dihydro-pyrazolo[1,5-c]quinazoline-2,5-dicarboxylic acid::CHEMBL8910
SMILES OC(=O)C1Nc2ccccc2-c2cc(nn12)C(O)=O
InChI Key InChIKey=LCIRCFHCQNNBAG-UHFFFAOYSA-N
Data  1 KI
  Tab Delimited (TSV)   2D SDfile   Computed 3D by Vconf -m prep SDfile
Find this compound or compounds like it in BindingDB:
Activity Spreadsheet -- Enzyme Inhibition Constant Data from BindingDB
Found 1 hit for monomerid = 50133105
TargetGlutamate receptor ionotropic, NMDA 1(RAT)
Moscow State University
Curated by ChEMBL
LigandPNGBDBM50133105(5,6-Dihydro-pyrazolo[1,5-c]quinazoline-2,5-dicarbo...)
Affinity DataKi:  1.41E+3nM. Assay description: Binding selectivity towards N-methyl-D-aspartate glutamate receptor 1 was determined by using [3H]- glycine/NMDA
In DepthDetails ArticlePubMed