BDBM50133300 CHEMBL3634943
SMILES OC(=O)c1ccc(O)c2nc(ccc12)C(=O)Nc1ccccc1F
InChI Key InChIKey=VXRHESIIIAERPF-UHFFFAOYSA-N
Data  1 IC50
  Tab Delimited (TSV)   2D SDfile   Computed 3D by Vconf -m prep SDfile
Find this compound or compounds like it in BindingDB:
Activity Spreadsheet -- Enzyme Inhibition Constant Data from BindingDB
Found 1 hit for monomerid = 50133300
TargetLysine-specific demethylase 4A(Homo sapiens (Human))
China Pharmaceutical University
Curated by ChEMBL
LigandPNGBDBM50133300(CHEMBL3634943)
Affinity DataIC50: >1.00E+5nM. Assay description: Inhibition of recombinant human JMJD2A using biotinylated histone H3 as substrate by AlphaScreen assay
In DepthDetails ArticlePubMed