BDBM50133323 CHEMBL3634958
SMILES C[C@@H](N(Cc1ccccc1F)S(=O)(=O)c1ccc(F)c(C)c1)C(=O)NO
InChI Key InChIKey=OYUGKKOFWDMSHS-GFCCVEGCSA-N
Data  2 IC50
  Tab Delimited (TSV)   2D SDfile   Computed 3D by Vconf -m prep SDfile
Find this compound or compounds like it in BindingDB:
Activity Spreadsheet -- Enzyme Inhibition Constant Data from BindingDB
Found 2 hits for monomerid = 50133323
TargetLethal factor(Bacillus anthracis)
University Of Minnesota
Curated by ChEMBL
LigandPNGBDBM50133323(CHEMBL3634958)
Affinity DataIC50:  3.30E+4nM. Assay description: Inhibition of Bacillus anthracis Lethal factor after 5 mins by FRET assay
In DepthDetails ArticlePubMed
TargetLethal factor(Bacillus anthracis)
University Of Minnesota
Curated by ChEMBL
LigandPNGBDBM50133323(CHEMBL3634958)
Affinity DataIC50:  9.50E+3nM. Assay description: Inhibition of Bacillus anthracis Lethal factor after 10 mins by mobility shift protease assay using 8 uM FITC as substrate
In DepthDetails ArticlePubMed