BDBM50133768 3-[5-(3,4-Dichloro-phenyl)-1H-imidazol-2-yl]-quinoline::CHEMBL420541
SMILES Clc1ccc(cc1Cl)-c1c[nH]c(n1)-c1cnc2ccccc2c1
InChI Key InChIKey=BEGDZSOACPTIDW-UHFFFAOYSA-N
Data  1 KI
  Tab Delimited (TSV)   2D SDfile   Computed 3D by Vconf -m prep SDfile
Find this compound or compounds like it in BindingDB:
Activity Spreadsheet -- Enzyme Inhibition Constant Data from BindingDB
Found 1 hit for monomerid = 50133768
TargetNeuropeptide Y receptor type 5(Homo sapiens (Human))
Pfizer
Curated by ChEMBL
LigandPNGBDBM50133768(3-[5-(3,4-Dichloro-phenyl)-1H-imidazol-2-yl]-quino...)
Affinity DataKi: >1.00E+4nM. Assay description: Binding affinity towards human neuropeptide Y receptor type 5 using [125I]-PYY as radiogigand in baculovirus-infected Sf9 cells
In DepthDetails ArticlePubMed