BDBM50133781 3-[5-(4-Trifluoromethoxy-phenyl)-1H-imidazol-2-yl]-pyridine::CHEMBL323658
SMILES FC(F)(F)Oc1ccc(cc1)-c1c[nH]c(n1)-c1cccnc1
InChI Key InChIKey=QFUHQTVKGNOKSY-UHFFFAOYSA-N
Data  1 KI
  Tab Delimited (TSV)   2D SDfile   Computed 3D by Vconf -m prep SDfile
Find this compound or compounds like it in BindingDB:
Activity Spreadsheet -- Enzyme Inhibition Constant Data from BindingDB
Found 1 hit for monomerid = 50133781
TargetNeuropeptide Y receptor type 5(Homo sapiens (Human))
Pfizer
Curated by ChEMBL
LigandPNGBDBM50133781(3-[5-(4-Trifluoromethoxy-phenyl)-1H-imidazol-2-yl]...)
Affinity DataKi:  210nM. Assay description: Binding affinity towards human neuropeptide Y receptor type 5 using [125I]-PYY as radiogigand in baculovirus-infected Sf9 cells
In DepthDetails ArticlePubMed