BDBM50134006 CHEMBL335564::N,N'-(9-(2-methoxyethylamino)acridine-3,6-diyl)bis(3-(pyrrolidin-1-yl)propanamide)::N-[9-(2-Methoxy-ethylamino)-6-(3-pyrrolidin-1-yl-propionylamino)-acridin-3-yl]-3-pyrrolidin-1-yl-propionamide
SMILES COCCNc1c2ccc(NC(=O)CCN3CCCC3)cc2nc2cc(NC(=O)CCN3CCCC3)ccc12
InChI Key InChIKey=VDFQRFWWLKQVTR-UHFFFAOYSA-N
Data  1 IC50  1 EC50
  Tab Delimited (TSV)   2D SDfile   Computed 3D by Vconf -m prep SDfile
Find this compound or compounds like it in BindingDB:
Activity Spreadsheet -- Enzyme Inhibition Constant Data from BindingDB
Found 2 hits for monomerid = 50134006
TargetTelomerase reverse transcriptase(Homo sapiens (Human))
Central University Of Las Villas
Curated by ChEMBL
LigandPNGBDBM50134006(CHEMBL335564 | N,N'-(9-(2-methoxyethylamino)acridi...)
Affinity DataIC50:  140nM. Assay description: Inhibition of telomerase in human A2780 cells by TRAP assay
In DepthDetails ArticlePubMed
TargetTelomerase reverse transcriptase(Homo sapiens (Human))
Central University Of Las Villas
Curated by ChEMBL
LigandPNGBDBM50134006(CHEMBL335564 | N,N'-(9-(2-methoxyethylamino)acridi...)
Affinity DataEC50:  140nM. Assay description: Inhibitory activity against human telomerase
In DepthDetails ArticlePubMed