BDBM50134089 CHEMBL3735502
SMILES CN(C)CC(=O)Nc1cccc(Nc2ncc(F)c(Nc3ccc(F)cc3)n2)c1
InChI Key InChIKey=QWUFJOPBOHFZST-UHFFFAOYSA-N
Data  2 IC50
  Tab Delimited (TSV)   2D SDfile   Computed 3D by Vconf -m prep SDfile
Find this compound or compounds like it in BindingDB:
Activity Spreadsheet -- Enzyme Inhibition Constant Data from BindingDB
Found 2 hits for monomerid = 50134089
TargetCyclin-dependent kinase 2/G1/S-specific cyclin-E1(Homo sapiens (Human))
Chinese Academy Of Medical Sciences And Peking Union Medical College
Curated by ChEMBL
LigandPNGBDBM50134089(CHEMBL3735502)
Affinity DataIC50:  1.71E+3nM. Assay description: Inhibition of CDK2/cyclin E1 (unknown origin) expressed in Sf9 insect cells using UlightCFFKNIVTPRTPPPSQGK-amide substrate after 15 mins by autoradio...
In DepthDetails ArticlePubMed
TargetCyclin-T1/Cyclin-dependent kinase 9(Homo sapiens (Human))
Chinese Academy Of Medical Sciences And Peking Union Medical College
Curated by ChEMBL
LigandPNGBDBM50134089(CHEMBL3735502)
Affinity DataIC50:  780nM. Assay description: Inhibition of CDK9/Cyclin-T1 (unknown origin) using UlightCFFKNIVTPRTPPPSQGK-amide substrate after 90 mins by autoradiography
In DepthDetails ArticlePubMed