BDBM50134233 CHEMBL3741909
SMILES CC1=NN(C(=O)C1)c1ccc(cc1)-c1ccccc1
InChI Key InChIKey=ZPQSYRQQCSMFMR-UHFFFAOYSA-N
Data  2 IC50
  Tab Delimited (TSV)   2D SDfile   Computed 3D by Vconf -m prep SDfile
Find this compound or compounds like it in BindingDB:
Activity Spreadsheet -- Enzyme Inhibition Constant Data from BindingDB
Found 2 hits for monomerid = 50134233
TargetAmyloid-beta precursor protein(Homo sapiens (Human))
Dalhousie University
Curated by ChEMBL
LigandPNGBDBM50134233(CHEMBL3741909)
Affinity DataIC50:  1.95E+4nM. Assay description: Inhibition of N-alpha-biotinyl-amyloid beta (1 to 42 residues) (unknown origin) oligomerization incubated for 1 hr by sandwich biotin-avidin assay
In DepthDetails ArticlePubMed
TargetAmyloid-beta precursor protein(Homo sapiens (Human))
Dalhousie University
Curated by ChEMBL
LigandPNGBDBM50134233(CHEMBL3741909)
Affinity DataIC50:  5.60E+3nM. Assay description: Inhibition of amyloid beta (1 to 40 residues) (unknown origin) aggregation incubated for 72 hrs by Thioflavin T assay
In DepthDetails ArticlePubMed