BDBM50134251 CHEMBL3746332
SMILES COc1ccc(cc1)S(=O)(=O)N(Nc1ccccc1)C(=O)Oc1ccc(Oc2ccccc2)cc1
InChI Key InChIKey=BNWICJQXSUBMPV-UHFFFAOYSA-N
Data  1 IC50
  Tab Delimited (TSV)   2D SDfile   Computed 3D by Vconf -m prep SDfile
Find this compound or compounds like it in BindingDB:
Activity Spreadsheet -- Enzyme Inhibition Constant Data from BindingDB
Found 1 hit for monomerid = 50134251
TargetProstaglandin E synthase(Homo sapiens (Human))
Kyung Hee University
Curated by ChEMBL
LigandPNGBDBM50134251(CHEMBL3746332)
Affinity DataIC50:  6.60E+3nM. Assay description: Inhibition of PGES-1 in human A549 cell microsomes using PGH2 as substrate assessed as suppression of interleukin-1beta-stimulated PGE2 production in...
In DepthDetails ArticlePubMed