BDBM50134456 2-[1-(3,4-Dihydroxy-phenyl)-meth-(Z)-ylidene]-5,6,7-trimethoxy-benzofuran-3-one::CHEMBL123786
SMILES COc1cc2C(=O)\C(Oc2c(OC)c1OC)=C\c1ccc(O)c(O)c1
InChI Key InChIKey=JHWOTQYPURPSBR-QPEQYQDCSA-N
Data  1 IC50
  Tab Delimited (TSV)   2D SDfile   Computed 3D by Vconf -m prep SDfile
Find this compound or compounds like it in BindingDB:
Activity Spreadsheet -- Enzyme Inhibition Constant Data from BindingDB
Found 1 hit for monomerid = 50134456
TargetTubulin alpha-1A chain(Sus scrofa (Pig))
Cardiff University
Curated by ChEMBL
LigandPNGBDBM50134456(2-[1-(3,4-Dihydroxy-phenyl)-meth-(Z)-ylidene]-5,6,...)
Affinity DataIC50: >5.00E+4nM. Assay description: Concentration that cause a 50% inhibition in tubulin assembly as measured by an increase inturbidity using microtubule assembly assay
In DepthDetails ArticlePubMed