BDBM50134466 CHEMBL3747116
SMILES Fc1ccc(cc1)N1CCn2nc(OCc3ccccc3)cc2C1=O
InChI Key InChIKey=PVXQBLCMLZKSAX-UHFFFAOYSA-N
Data  12 EC50
  Tab Delimited (TSV)   2D SDfile   Computed 3D by Vconf -m prep SDfile
Find this compound or compounds like it in BindingDB:
Activity Spreadsheet -- Enzyme Inhibition Constant Data from BindingDB
Found 12 hits for monomerid = 50134466
TargetMetabotropic glutamate receptor 5(Homo sapiens (Human))
Janssen Pharmaceutica
Curated by ChEMBL
LigandPNGBDBM50134466(CHEMBL3747116)
Affinity DataEC50:  158nM. Assay description: Positive allosteric modulation of human mGlu5 expressed in HEK293 cells assessed as glutamate-induced calcium mobilization
In DepthDetails ArticlePubMed
TargetMetabotropic glutamate receptor 5(Homo sapiens (Human))
Janssen Pharmaceutica
Curated by ChEMBL
LigandPNGBDBM50134466(CHEMBL3747116)
Affinity DataEC50:  160nM. Assay description: Positive allosteric modulation of human mGlu5 expressed in HEK293 cells assessed as glutamate-induced calcium mobilization
In DepthDetails ArticlePubMed
TargetMetabotropic glutamate receptor 3(Homo sapiens (Human))
Janssen Pharmaceutica
Curated by ChEMBL
LigandPNGBDBM50134466(CHEMBL3747116)
Affinity DataEC50:  3.39E+3nM. Assay description: Antagonist activity at human mGlu3 expressed in HEK293 cells assessed as inhibition of glutamate-induced calcium mobilization
In DepthDetails ArticlePubMed
TargetMetabotropic glutamate receptor 1(Homo sapiens (Human))
Janssen Pharmaceutica
Curated by ChEMBL
LigandPNGBDBM50134466(CHEMBL3747116)
Affinity DataEC50: >1.00E+4nM. Assay description: Positive allosteric modulation of human mGlu1 receptor expressed in HEK293 cells assessed as calcium mobilization by fluorescence analysis
In DepthDetails ArticlePubMed
TargetMetabotropic glutamate receptor 2(Homo sapiens (Human))
Janssen Pharmaceutica
Curated by ChEMBL
LigandPNGBDBM50134466(CHEMBL3747116)
Affinity DataEC50: >1.00E+4nM. Assay description: Positive allosteric modulation of human mGlu2 receptor expressed in HEK293 cells assessed as calcium mobilization by fluorescence analysis
In DepthDetails ArticlePubMed
TargetMetabotropic glutamate receptor 6(Rattus norvegicus (Rat))
Janssen Pharmaceutica
Curated by ChEMBL
LigandPNGBDBM50134466(CHEMBL3747116)
Affinity DataEC50: >1.00E+4nM. Assay description: Positive allosteric modulation of rat mGlu6 receptor expressed in CHO cells by [35S]-GTPgammaS binding assay
In DepthDetails ArticlePubMed
TargetMetabotropic glutamate receptor 8(Homo sapiens (Human))
Janssen Pharmaceutica
Curated by ChEMBL
LigandPNGBDBM50134466(CHEMBL3747116)
Affinity DataEC50: >1.00E+4nM. Assay description: Positive allosteric modulation of human mGlu8 receptor expressed in HEK293 cells assessed as calcium mobilization by fluorescence analysis
In DepthDetails ArticlePubMed
TargetMetabotropic glutamate receptor 4(Homo sapiens (Human))
Janssen Pharmaceutica
Curated by ChEMBL
LigandPNGBDBM50134466(CHEMBL3747116)
Affinity DataEC50: >1.00E+4nM. Assay description: Positive allosteric modulation of human mGlu4 receptor expressed in HEK293 cells assessed as calcium mobilization by fluorescence analysis
In DepthDetails ArticlePubMed
TargetMetabotropic glutamate receptor 4(Homo sapiens (Human))
Janssen Pharmaceutica
Curated by ChEMBL
LigandPNGBDBM50134466(CHEMBL3747116)
Affinity DataEC50: >1.00E+4nM. Assay description: Positive allosteric modulation of human mGlu4 receptor expressed in L929sA cells assessed as calcium mobilization by fluorescence analysis
In DepthDetails ArticlePubMed
TargetMetabotropic glutamate receptor 4(Homo sapiens (Human))
Janssen Pharmaceutica
Curated by ChEMBL
LigandPNGBDBM50134466(CHEMBL3747116)
Affinity DataEC50: >1.00E+4nM. Assay description: Positive allosteric modulation of human mGlu4 receptor expressed in HEK293 cells by [35S]-GTPgammaS binding assay
In DepthDetails ArticlePubMed
TargetMetabotropic glutamate receptor 4(Homo sapiens (Human))
Janssen Pharmaceutica
Curated by ChEMBL
LigandPNGBDBM50134466(CHEMBL3747116)
Affinity DataEC50: >1.00E+4nM. Assay description: Positive allosteric modulation of human mGlu4 receptor expressed in L929sA cells by [35S]-GTPgammaS binding assay
In DepthDetails ArticlePubMed
TargetMetabotropic glutamate receptor 7(Homo sapiens (Human))
Janssen Pharmaceutica
Curated by ChEMBL
LigandPNGBDBM50134466(CHEMBL3747116)
Affinity DataEC50: >1.00E+4nM. Assay description: Positive allosteric modulation of human mGlu7 receptor expressed in HEK293 cells assessed as calcium mobilization by fluorescence analysis
In DepthDetails ArticlePubMed