BDBM50134602 CHEMBL3747489
SMILES Cn1c2nc(NC3CCN(CC3)S(N)(=O)=O)ncc2cc(Oc2ccc(F)cc2F)c1=O
InChI Key InChIKey=MIRPOEPPAAEKAX-UHFFFAOYSA-N
Data  1 IC50
  Tab Delimited (TSV)   2D SDfile   Computed 3D by Vconf -m prep SDfile
Find this compound or compounds like it in BindingDB:
Activity Spreadsheet -- Enzyme Inhibition Constant Data from BindingDB
Found 1 hit for monomerid = 50134602
TargetMitogen-activated protein kinase 8(Homo sapiens (Human))
Semmelweis University
Curated by ChEMBL
LigandPNGBDBM50134602(CHEMBL3747489)
Affinity DataIC50:  910nM. Assay description: Inhibition of JNK1 (unknown origin)
In DepthDetails ArticlePubMed