BDBM50134617 CHEMBL3746623
SMILES Cn1c2nc(NCc3ccccn3)ncc2cc(Oc2ccc(F)cc2F)c1=O
InChI Key InChIKey=SQZRWTSJUPZFND-UHFFFAOYSA-N
Data  1 IC50
  Tab Delimited (TSV)   2D SDfile   Computed 3D by Vconf -m prep SDfile
Find this compound or compounds like it in BindingDB:
Activity Spreadsheet -- Enzyme Inhibition Constant Data from BindingDB
Found 1 hit for monomerid = 50134617
TargetMitogen-activated protein kinase 8(Homo sapiens (Human))
Semmelweis University
Curated by ChEMBL
LigandPNGBDBM50134617(CHEMBL3746623)
Affinity DataIC50: >2.30E+4nM. Assay description: Inhibition of JNK1 (unknown origin)
In DepthDetails ArticlePubMed