BDBM50134650 (4-Benzyl-piperidin-1-yl)-(7-hydroxy-1H-indol-2-yl)-methanone::(4-benzylpiperidin-1-yl)(7-hydroxy-1H-indol-2-yl)methanone::CHEMBL123908
SMILES Oc1cccc2cc([nH]c12)C(=O)N1CCC(Cc2ccccc2)CC1
InChI Key InChIKey=IWBBGNZPEIAVFV-UHFFFAOYSA-N
Data  3 IC50
  Tab Delimited (TSV)   2D SDfile   Computed 3D by Vconf -m prep SDfile
Find this compound or compounds like it in BindingDB:
Activity Spreadsheet -- Enzyme Inhibition Constant Data from BindingDB
Found 3 hits for monomerid = 50134650
TargetGlutamate receptor ionotropic, NMDA 2B(Rattus norvegicus (Rat))
Gedeon Richter
Curated by ChEMBL
LigandPNGBDBM50134650((4-Benzyl-piperidin-1-yl)-(7-hydroxy-1H-indol-2-yl...)
Affinity DataIC50:  380nM. Assay description: Displacement of [3H]Ro 25,6981 from NR2B NMDA receptor in rat forebrain
In DepthDetails ArticlePubMed
TargetGlutamate receptor ionotropic, NMDA 1/2B(Homo sapiens (Human))
Gedeon Richter
Curated by ChEMBL
LigandPNGBDBM50134650((4-Benzyl-piperidin-1-yl)-(7-hydroxy-1H-indol-2-yl...)
Affinity DataIC50:  77nM. Assay description: Inhibition of N-methyl-D-aspartate glutamate receptor-evoked increase of intracellular Ca+ in cells expressing NMDA glutamate receptor 1/2B
In DepthDetails ArticlePubMed
TargetGlutamate receptor ionotropic, NMDA 2B(Rattus norvegicus (Rat))
Gedeon Richter
Curated by ChEMBL
LigandPNGBDBM50134650((4-Benzyl-piperidin-1-yl)-(7-hydroxy-1H-indol-2-yl...)
Affinity DataIC50:  165nM. Assay description: Antagonist activity at NR2B NMDA receptor in Wistar rat neocortical cells assessed as inhibition of NMDA-evoked elevation of intracellular calcium co...
In DepthDetails ArticlePubMed