BDBM50134707 CHEMBL3746771
SMILES CN(C1CCN(CCOc2ccccc2C(C)(C)C)CC1)S(=O)(=O)c1cnn(C)c1
InChI Key InChIKey=MKSFZMXFGKIKIM-UHFFFAOYSA-N
Data  4 KI
  Tab Delimited (TSV)   2D SDfile   Computed 3D by Vconf -m prep SDfile
Find this compound or compounds like it in BindingDB:
Activity Spreadsheet -- Enzyme Inhibition Constant Data from BindingDB
Found 4 hits for monomerid = 50134707
Target5-hydroxytryptamine receptor 7(Homo sapiens (Human))
Jagiellonian University Medical College
Curated by ChEMBL
LigandPNGBDBM50134707(CHEMBL3746771)
Affinity DataKi:  58nM. Assay description: Displacement of [3H]-5-CT from human 5-HT7B receptor expressed in HEK293 cells incubated for 1 hr
In DepthDetails ArticlePubMed
TargetD(2) dopamine receptor(Homo sapiens (Human))
Jagiellonian University Medical College
Curated by ChEMBL
LigandPNGBDBM50134707(CHEMBL3746771)
Affinity DataKi:  280nM. Assay description: Displacement of [3H]-Raclopride from human dopamine D2L receptor expressed in HEK293 cells incubated for 1 hr
In DepthDetails ArticlePubMed
Target5-hydroxytryptamine receptor 2A(Homo sapiens (Human))
Jagiellonian University Medical College
Curated by ChEMBL
LigandPNGBDBM50134707(CHEMBL3746771)
Affinity DataKi:  557nM. Assay description: Displacement of [3H]-ketanserin from human 5-HT2A receptor expressed in HEK293 cells incubated for 1 hr
In DepthDetails ArticlePubMed
Target5-hydroxytryptamine receptor 1A(Homo sapiens (Human))
Jagiellonian University Medical College
Curated by ChEMBL
LigandPNGBDBM50134707(CHEMBL3746771)
Affinity DataKi:  9.63E+3nM. Assay description: Displacement of [3H]-8-OH-DPAT from human 5-HT1A receptor expressed in HEK293 cells incubated for 1 hr
In DepthDetails ArticlePubMed